�S���n�������c�̃R�[�h,ID,�n�������c�̖�,����,����_�J�i,����_�p��,���ݒn_�S���n�������c�̃R�[�h,����ID,���ݒn_�A���\�L,���ݒn_�s���{��,���ݒn_�s�撬��,���ݒn_����,���ݒn_�Ԓn�ȉ�,��������(����),�ܓx,�o�x,���x�̎��,���x�̒l,�ݒu�ʒu,�d�b�ԍ�,�����ԍ�,�A���惁�[���A�h���X,�A����FormURL,�A������l�i���̑��ASNS�Ȃǁj,�X�֔ԍ�,�@�l�ԍ�,�c�̖�,���p�\�j��,�J�n����,�I������,���p�\�������L����,�����Ή��ݔ��̗L��,URL,�摜1,�摜1_���C�Z���X,�摜2,�摜2_���C�Z���X,�O�����p�s��,���l
221007,2210070001,�É����É��s,���x��,�C�J���V�V��,,221007,,������U�T�U�|�Q,,������U�T�U�|�Q,,,,,,,,���x�����֐���,054-260-2211,,,,,,,,���ΐ��؋�,8:30,17:15,�j��������,,,,,,,,
221007,2210070002,�É����É��s,�É�����,�V�Y�I�J�`���E�V��,,221007,,����ǎ蒬�T�ԂP��,,����ǎ蒬�T�ԂP��,,,,,,,,�V�قP�K�G�X�J���[�^�[�o����,054-254-2111,,,,,,,,���ΐ��؋�,7:30,18:00,�j��������,,,,,,,,
221007,2210070003,�É����É��s,�É�����,�V�Y�I�J�`���E�V��,,221007,,����ǎ蒬�T�ԂP��,,����ǎ蒬�T�ԂP��,,,,,,,,�V�قQ�K�G�X�J���[�^�[���ʘH�i�R�K�K�i�o�����j,054-254-2111,,,,,,,,���ΐ��؋�,7:30,18:00,�j��������,,,,,,,,
221007,2210070004,�É����É��s,�É�����,�V�Y�I�J�`���E�V��,,221007,,����ǎ蒬�T�ԂP��,,����ǎ蒬�T�ԂP��,,,,,,,,�V�قR�K�{�٘A���ʘH�����O�i�[�ŉۑO�j,054-254-2111,,,,,,,,���ΐ��؋�,7:30,18:00,�j��������,,,,,,,,
221007,2210070005,�É����É��s,�É�����,�V�Y�I�J�`���E�V��,,221007,,����ǎ蒬�T�ԂP��,,����ǎ蒬�T�ԂP��,,,,,,,,�{�قP�K���ʎs���M�������[������,054-254-2111,,,,,,,,���ΐ��؋�,7:30,18:00,�j��������,,,,,,,,
221007,2210070006,�É����É��s,�É�����,�V�Y�I�J�`���E�V��,,221007,,����ǎ蒬�T�ԂP��,,����ǎ蒬�T�ԂP��,,,,,,,,�V�قW�K�G���x�[�^�[�z�[���t��,054-254-2111,,,,,,,,���ΐ��؋�,7:30,18:00,�j��������,,,,,,,,
221007,2210070007,�É����É��s,�É�����,�V�Y�I�J�`���E�V��,,221007,,����ǎ蒬�T�ԂP��,,����ǎ蒬�T�ԂP��,,,,,,,,�V�قP�K��K������,054-254-2111,,,,,,,,���ΐ��؋�,7:30,18:00,�j��������,,,,,,,,
221007,2210070008,�É����É��s,�É�����,�V�Y�I�J�`���E�V��,,221007,,����ǎ蒬�T�ԂP��,,����ǎ蒬�T�ԂP��,,,,,,,,�c��}������,054-221-1158,,,,,,,,���ΐ��؋�,8:30,17:15,�j��������,,,,,,,,
221007,2210070009,�É����É��s,�É�����,�V�Y�I�J�`���E�V��,,221007,,����ǎ蒬�T�ԂP��,,����ǎ蒬�T�ԂP��,,,,,,,,�܂��͌��ꐄ�i�ۂɂđݏo��t,054-221-1228,,,,,,,,���ΐ��؋�,8:30,17:15,�j��������,,,,,,,,
221007,2210070010,�É����É��s,�É�����,�V�Y�I�J�`���E�V��,,221007,,����ǎ蒬�T�ԂP��,,����ǎ蒬�T�ԂP��,,,,,,,,�܂��͌��ꐄ�i�ۂɂđݏo��t,054-221-1228,,,,,,,,���ΐ��؋�,8:30,17:15,�j��������,,,,,,,,
221007,2210070011,�É����É��s,�É�����,�V�Y�I�J�`���E�V��,,221007,,����ǎ蒬�T�ԂP��,,����ǎ蒬�T�ԂP��,,,,,,,,�܂��͌��ꐄ�i�ۂɂđݏo��t,054-221-1228,,,,,,,,���ΐ��؋�,8:30,17:15,�j��������,,,,,,,,
221007,2210070012,�É����É��s,�É�����,�V�Y�I�J�`���E�V��,,221007,,����ǎ蒬�T�ԂP��,,����ǎ蒬�T�ԂP��,,,,,,,,�܂��͌��ꐄ�i�ۂɂđݏo��t,054-221-1228,,,,,,,,���ΐ��؋�,8:30,17:15,�j��������,,,,,,,,
221007,2210070013,�É����É��s,�É�����,�V�Y�I�J�`���E�V��,,221007,,����ǎ蒬�T�ԂP��,,����ǎ蒬�T�ԂP��,,,,,,,,�܂��͌��ꐄ�i�ۂɂđݏo��t,054-221-1228,,,,,,,,���ΐ��؋�,8:30,17:15,�j��������,,,,,,,,
221007,2210070014,�É����É��s,�É�����,�V�Y�I�J�`���E�V��,,221007,,����ǎ蒬�T�ԂP��,,����ǎ蒬�T�ԂP��,,,,,,,,�É����ɐV�قU�K,054-221-1199,,,,,,,,���ΐ��؋�,8:30,17:15,�j��������,,,,,,,,
221007,2210070015,�É����É��s,���h���Ɂi�����h���j,�V���E�{�E�`���E�V���A�I�C�V���E�{�E�V��,,221007,,����ǎ蒬�U�ԂQ��,,����ǎ蒬�U�ԂQ��,,,,,,,,�P�K���փz�[��,054-255-0119,,,,,,,,���ΐ��؋��y��,0:00,23:59,,,,,,,,,
221007,2210070016,�É����É��s,�~�P���L�����v��,�E���K�V�}�L�����v�W���E,,221007,,����~�P���R�P�X�W�Ԓn�n��,,����~�P���R�P�X�W�Ԓn�n��,,,,,,,,�Ǘ�������,054-269-2459,,,,,,,,,,,�{�ݎg�p���̂�,,,,,,,,
221007,2210070017,�É����É��s,��k�^����,�W���E�z�N�E���h�E�W���E,,221007,,�����⒬�P�ԂQ�O��,,�����⒬�P�ԂQ�O��,,,,,,,,�k�b����,054-248-9416,,,,,,,,���ΐ��؋��y��,9:00,21:00,�N���N�n����,,,,,,,,
221007,2210070018,�É����É��s,�ʐ�L�����v�Z���^�[,�^�}�J���L�����v�Z���^�[,,221007,,���撷�ȓc�V�T�T�Ԓn,,���撷�ȓc�V�T�T�Ԓn,,,,,,,,�Ǘ��������i�����O�j,054-297�]2016,,,,,,,,,,,�{�ݎg�p���̂�,,,,,,,,
221007,2210070019,�É����É��s,�����̈��,�`���E�I�E�^�C�C�N�J��,,221007,,����x�{���Q�ԂW�O��,,����x�{���Q�ԂW�O��,,,,,,,,�̈�قP�K�z�[��,054-255-1010,,,,,,,,���ΐ��؋��y��,8:30,21:00,�N���N�n����,,,,,,,,
221007,2210070020,�É����É��s,�����̈��,�`���E�I�E�^�C�C�N�J��,,221007,,����x�{���Q�ԂW�O��,,����x�{���Q�ԂW�O��,,,,,,,,�����v�[����������,054-255-1010,,,,,,,,���ΐ��؋��y��,8:30,21:00,�N���N�n����,,,,,,,,
221007,2210070021,�É����É��s,�����̈��,�g�E�u�^�C�C�N�J��,,221007,,���擌���c�񒚖ڂR�ԂP��,,���擌���c�񒚖ڂR�ԂP��,,,,,,,,�P�K������������,054-264-8485,,,,,,,,���ΐ��؋��y��,8:30,21:00,�N���N�n����,,,,,,,,
221007,2210070022,�É����É��s,���P�J�����^����,�j�V�K���\�E�S�E�E���h�E�W���E,,221007,,���搼�P�J�W�Ԓn�̂P,,���搼�P�J�W�Ԓn�̂P,,,,,,,,�Ǘ��������@��,054-296-1900,,,,,,,,���ΐ��؋��y��,8:30,21:00,�N���N�n����,,,,,,,,
221007,2210070023,�É����É��s,���P�J�����^����,�j�V�K���\�E�S�E�E���h�E�W���E,,221007,,���搼�P�J�W�Ԓn�̂P,,���搼�P�J�W�Ԓn�̂P,,,,,,,,�����v�[����������,054-296-6678,,,,,,,,���ΐ��؋��y��,8:30,21:00,�N���N�n����,,,,,,,,
221007,2210070024,�É����É��s,���P�J�����^����,�j�V�K���\�E�S�E�E���h�E�W���E,,221007,,���搼�P�J�W�Ԓn�̂P,,���搼�P�J�W�Ԓn�̂P,,,,,,,,�싅��3�ۑ��I��o�����ʘH,054-296-1900,,,,,,,,���ΐ��؋��y��,8:30,21:00,�N���N�n����,,,,,,,,
221007,2210070025,�É����É��s,���P�J�����^����,�j�V�K���\�E�S�E�E���h�E�W���E,,221007,,���搼�P�J�W�Ԓn�̂P,,���搼�P�J�W�Ԓn�̂P,,,,,,,,�e�j�X�R�[�g�N���u�n�E�X,054-296-1900,,,,,,,,���ΐ��؋��y��,8:30,21:00,�N���N�n����,,,,,,,,
221007,2210070026,�É����É��s,�ӂꂠ�����N���i�فi��E��E��j,�t���A�C�P���R�E�]�E�V���J���i���E���E���j,,221007,,��������P�R�V�X�|�P,,��������P�R�V�X�|�P,,,,,,,,��t��,054-263-3456,,,,,,,,���ΐ��؋��y��,10:00,21:00,�N���N�n����,,,,,,,,
221007,2210070027,�É����É��s,�ӂꂠ�����N���i�فi��E��E��j,�t���A�C�P���R�E�]�E�V���J���i���E���E���j,,221007,,��������P�R�V�X�|�P,,��������P�R�V�X�|�P,,,,,,,,�Q�K����O,054-263-3456,,,,,,,,���ΐ��؋��y��,10:00,21:00,�N���N�n����,,,,,,,,
221007,2210070028,�É����É��s,�ӂꂠ�����N���i�فi��E��E��j,�t���A�C�P���R�E�]�E�V���J���i���E���E���j,,221007,,��������P�R�V�X�|�P,,��������P�R�V�X�|�P,,,,,,,,�P�K�Ď�������,054-263-3456,,,,,,,,���ΐ��؋��y��,10:00,21:00,�N���N�n����,,,,,,,,
221007,2210070029,�É����É��s,�k���̈��,�z�N�u�^�C�C�N�J��,,221007,,���揼�x�l���ڂP�S�ԂP��,,���揼�x�l���ڂP�S�ԂP��,,,,,,,,�P�K������������,054-255-6262,,,,,,,,���ΐ��؋��y��,8:30,21:00,�N���N�n����,,,,,,,,
221007,2210070030,�É����É��s,�x�{�郉���E�A���h�E���t���b�V���X�e�[�V����,�X���v�W���E�����E�A���h�E���t���b�V���X�e�[�V����,,221007,,����x�{���Q�ԂW�O��,,����x�{���Q�ԂW�O��,,,,,,,,�J�E���^�[��,054-201-9200,,,,,,,,���ΐ��؋��y��,7:00,21:00,�N���N�n����,,,,,,,,
221007,2210070031,�É����É��s,�X�|�[�c�U����,�X�|�[�c�V���R�E�J,,221007,,����ǎ蒬�T�ԂP��,,����ǎ蒬�T�ԂP��,,,,,,,,�X�|�[�c�U���ۉۓ�,054-221-1038,,,,,,,,,,,�C�x���g�J�Î��̂�,,,,,,,,
221007,2210070032,�É����É��s,�����v�ۏ��w�Z,�L���E�A�V�N�{�V���E�K�b�R�E,,221007,,���摫�v�ۉ��g741-1,,���摫�v�ۉ��g741-1,,,,,,,,�̈�ٓ�,054-221-1038,,,,,,,,���ΐ��؋��y��,,,�{�ݎg�p���̂�,,,,,,,,
221007,2210070033,�É����É��s,�k���ΘJ�ҕ����Z���^�[,�z�N�u�L�����E�V���t�N�V�Z���^�[,,221007,,����{�ʎ����ڂP�P�ԂX��,,����{�ʎ����ڂP�P�ԂX��,,,,,,,,�S�K�g���[�j���O���,054-251-2315,,,,,,,,���ΐ��؋��y��,10:00,22:00,��Q�A�S�A�T���j���A�j���A�N���N�n����,,,,,,,,
221007,2210070034,�É����É��s,���o�E�G�����X�L�[��,���o�E�F���C�J���X�L�[�W���E,,221007,,������Q�U�Q�X�Ԓn�̂P�X�O,,������Q�U�Q�X�Ԓn�̂P�X�O,,,,,,,,���X�g�n�E�X��t,054-260-2316,,,,,,,,,8:30,16:00,�{�݂̗��p�\���Ԃɏ]��,,,,,,,,
221007,2210070035,�É����É��s,���o�E�G�����X�L�[��,���o�E�F���C�J���X�L�[�W���E,,221007,,������Q�U�Q�X�Ԓn�̂P�X�O,,������Q�U�Q�X�Ԓn�̂P�X�O,,,,,,,,���t�g�^�]���i�~���j,054-260-2316,,,,,,,,,8:30,16:00,���t�g�^�]���̂�,,,,,,,,
221007,2210070036,�É����É��s,�����U�w�K�Z���^�[�i�A�C�Z���Q�P�j,�A�I�C�V���E�K�C�K�N�V���E�Z���^�[�i�A�C�Z���j�W���E�C�`�j,,221007,,���擌���[���R�ԂP�W��,,���擌���[���R�ԂP�W��,,,,,,,,�Q�K�������O,054-246-6191,,,,,,,,���ΐ��؋��y��,9:00,21:30,��Q�A�S���j���A�N���N�n����,,,,,,,,
221007,2210070037,�É����É��s,�~�������U�w�K�𗬊�,�E���K�V�}�V���E�K�C�K�N�V���E�R�E�����E�J��,,221007,,����~�����P�R�O�X�Ԓn,,����~�����P�R�O�X�Ԓn,,,,,,,,�P�K���փz�[��,054-269-2002,,,,,,,,���ΐ��؋�,8:30,17:15,�j���A�N���N�n����,,,,,,,,
221007,2210070038,�É����É��s,��쐶�U�w�K�𗬊�,�I�I�J���V���E�K�C�K�N�V���E�R�E�����E�J��,,221007,,��������P�O�Ԓn,,��������P�O�Ԓn,,,,,,,,�P�K�z�[��������,054-291-2002,,,,,,,,���ΐ��؋�,8:30,17:15,�j���A�N���N�n����,,,,,,,,
221007,2210070039,�É����É��s,��͓����U�w�K�𗬊�,�I�I�R�E�`�V���E�K�C�K�N�V���E�R�E�����E�J��,,221007,,���敽��P�O�X�V�Ԓn�̂R�W,,���敽��P�O�X�V�Ԓn�̂R�W,,,,,,,,�P�K��t�J�E���^�[��,054-293-2111,,,,,,,,���ΐ��؋�,8:30,17:15,�j���A�N���N�n����,,,,,,,,
221007,2210070040,�É����É��s,���򐶊U�w�K�𗬊�,�L���T���V���E�K�C�K�N�V���E�R�E�R�E�����E�J��,,221007,,���撋���n�U�U�Ԓn�̂Q,,���撋���n�U�U�Ԓn�̂Q,,,,,,,,�P�K���փz�[��,054-295-3111,,,,,,,,���ΐ��؋�,8:30,17:15,�j���A�N���N�n����,,,,,,,,
221007,2210070041,�É����É��s,�������U�w�K�Z���^�[,�Z�C�u�V���E�K�C�K�N�V���E�Z���^�[,,221007,,����c���O���ڂS�U�Ԓn�̂T,,����c���O���ڂS�U�Ԓn�̂T,,,,,,,,�P�K���փz�[����R�W���,054-255-3960,,,,,,,,���ΐ��؋��y��,,,�{�݂̗��p�\���Ԃɏ]��,,,,,,,,
221007,2210070042,�É����É��s,�ʐ쐶�U�w�K�𗬊�,�^�}�J���V���E�K�C�K�N�V���E�R�E�����E�J��,,221007,,���旎���P�Q�R�Ԓn�̂Q,,���旎���P�Q�R�Ԓn�̂Q,,,,,,,,�P�K�z�[��,054-292-2111,,,,,,,,���ΐ��؋�,8:30,17:15,�j���A�N���N�n����,,,,,,,,
221007,2210070043,�É����É��s,�������U�w�K�Z���^�[,�g�E�u�V���E�K�C�K�N�V���E�Z���^�[,,221007,,������c�����ڂW�ԂP�T��,,������c�����ڂW�ԂP�T��,,,,,,,,�P�K���r�[,054-263-0338,,,,,,,,���ΐ��؋��y��,,,�{�݂̗��p�\���Ԃɏ]��,,,,,,,,
221007,2210070044,�É����É��s,���ސ��U�w�K�Z���^�[,�j�V�i�V���E�K�C�K�N�V���E�Z���^�[,,221007,,���搣���񒚖ڂR�Q�ԂS�R��,,���搣���񒚖ڂR�Q�ԂS�R��,,,,,,,,�P�K��P���ԏꑤ����,054-265-2468,,,,,,,,���ΐ��؋��y��,,,�{�݂̗��p�\���Ԃɏ]��,,,,,,,,
221007,2210070045,�É����É��s,�k�����U�w�K�Z���^�[,�z�N�u�V���E�K�C�K�N�V���E�Z���^�[,,221007,,���揺�{�񒚖ڂP�S�ԂP��,,���揺�{�񒚖ڂP�S�ԂP��,,,,,,,,�P�K���փz�[������,054-271-5111,,,,,,,,���ΐ��؋��y��,,,�{�݂̗��p�\���Ԃɏ]��,,,,,,,,
221007,2210070046,�É����É��s,�m�Ȑ��U�w�K�Z���^�[,�����V�i�V���E�K�C�K�N�V���E�Z���^�[,,221007,,����H���{���T�ԂX��,,����H���{���T�ԂX��,,,,,,,,�P�K���փz�[����������,054-278-4141,,,,,,,,�ΐ��؋��y��,9:00,21:30,�j���A�N���N�n����,,,,,,,,
221007,2210070047,�É����É��s,�����}����,�`���E�I�E�g�V���J��,,221007,,������{���Q�X�ԂP��,,������{���Q�X�ԂP��,,,,,,,,�P�K�ԋp�J�E���^�[,054-247-6711,,,,,,,,���ΐ��؋��y��,,,�{�݂̗��p�\���Ԃɏ]��,,,,,,,,
221007,2210070048,�É����É��s,�����}���ٖ��@����,�`���E�I�E�g�V���J���A�A�T�o�^�u���J��,,221007,,����L�i���Q��43��,,����L�i���Q��43��,,,,,,,,�P�K�z�[��,054-248-5035,,,,,,,,���ΐ��؋��y��,,,�{�݂̗��p�\���Ԃɏ]��,,,,,,,,
221007,2210070049,�É����É��s,�����}���ٔ��a����,�`���E�I�E�g�V���J���~���u���J��,,221007,,������{���c�n�T�ԂP��,,������{���c�n�T�ԂP��,,,,,,,,�P�K�z�[������������,054-296-6501,,,,,,,,���ΐ��؋��y��,,,�{�݂̗��p�\���Ԃɏ]��,,,,,,,,
221007,2210070050,�É����É��s,�k���}����,�z�N�u�g�V���J��,,221007,,����^��Z���ڂP�V�ԂP�O��,,����^��Z���ڂP�V�ԂP�O��,,,,,,,,�P�K�a��������,054-653-1817,,,,,,,,���ΐ��؋��y��,,,�{�݂̗��p�\���Ԃɏ]��,,,,,,,,
221007,2210070051,�É����É��s,��K���}����,�~���L�`���E�g�V���J��,,221007,,"�����K���R�Ԓn�̂Q�P
�i�y�K�T�[�g�S�E�T�K�j",,"�����K���R�Ԓn�̂Q�P
�i�y�K�T�[�g�S�E�T�K�j",,,,,,,,�T�K�{�����e�B�A��������,054-251-1868,,,,,,,,���ΐ��؋��y��,,,�{�݂̗��p�\���Ԃɏ]��,,,,,,,,
221007,2210070052,�É����É��s,�Y�w�𗬃Z���^�[,�T���K�N�R�E�����E�Z���^�[,,221007,,"�����K���R�Ԓn�Q�P
�i�y�K�T�[�g�U�E�V�K�j",,"�����K���R�Ԓn�Q�P
�i�y�K�T�[�g�U�E�V�K�j",,,,,,,,�U�K���ʓ����E����,054-275-1655,,,,,,,,���ΐ��؋��y,9:30,22:00,�j������,,,,,,,,
221007,2210070053,�É����É��s,�É����y��,�V�Y�I�J�I���K�N�J��,,221007,,���捕�����P�Ԓn�̂X,,���捕�����P�Ԓn�̂X,,,,,,,,�V�K�������O��t�J�E���^�[,054-251-2200,,,,,,,,�ΐ��؋��y��,9:00,21:30,�N���N�n����,,,,,,,,
221007,2210070054,�É����É��s,�É��s���p��,�V�Y�I�J�V�r�W���c�J��,,221007,,"���据�����P�V�Ԓn�̂P
���^���[�R�K",,"���据�����P�V�Ԓn�̂P
���^���[�R�K",,,,,,,,�W�����O,054-273-1515,,,,,,,,�ΐ��؋��y��,10:00,19:00,�N���N�n����,,,,,,,,
221007,2210070055,�É����É��s,�É��s���������,�V�Y�I�J�V�~���u���J�J�C�J��,,221007,,����x�{���Q�ԂX�O��,,����x�{���Q�ԂX�O��,,,,,,,,���r�[���P�K�x�e����,054-251-3751,,,,,,,,�ΐ��؋��y��,9:00,21:30,�N���N�n����,,,,,,,,
221007,2210070056,�É����É��s,�É��s��������ّO���ԏ�,�V�Y�I�J�V�~���u���J�J�C�J���}�G�`���E�V���W���E,,221007,,����x�{���Q�ԂV�T��,,����x�{���Q�ԂV�T��,,,,,,,,���ԏ�g�C����,,,,,,,,,���ΐ��؋��y��,8:30,22:00,�N���N�n����,,,,,,,,
221007,2210070057,�É����É��s,���������w�L�O��,�i�J�J���X�P�u���K�N�L�l���J��,,221007,,����V�ԂP�O�W�X�Ԓn�̂P�Q�O,,����V�ԂP�O�W�X�Ԓn�̂P�Q�O,,,,,,,,����,054-277-2970,,,,,,,,�ΐ��؋��y��,10:00,17:00,�N���N�n����,,,,,,,,
221007,2210070058,�É����É��s,��������������,�����ݶ�޲�خ���,,221007,,"����{���蒬�P�O�Q�Ԓn
�É���Ԑ_�Ћ���",,"����{���蒬�P�O�Q�Ԓn
�É���Ԑ_�Ћ���",,,,,,,,���փz�[�����ʉE��,,,,,,,,,���ΐ��؋��y��,9:00,18:00,�ْ�,,,,,,,,
221007,2210070059,�É����É��s,�Ԓ��s�������Z���^�[,�o���`���E�V�~���J�c�h�E�Z���^�[,,221007,,�����Ԓ��T�O�Ԓn,,�����Ԓ��T�O�Ԓn,,,,,,,,�����t�ߎ�t�O,054-273-1212,,,,,,,,���ΐ��؋��y��,,,�{�݂̗��p�\���Ԃɏ]��,,,,,,,,
221007,2210070060,�É����É��s,�G�@�s�s�R���𗬃Z���^�[�i���{������j,�V�Y�n�^�g�V�T���\���R�E�����E�Z���^�[�A�x�S�R��,,221007,,���拍�ȂQ�R�T�Q�Ԓn,,���拍�ȂQ�R�T�Q�Ԓn,,,,,,,,�Ǘ�����������,054-294-2501,,,,,,,,�ΐ��؋��y��,9:00,17:00,��S�Ηj���A�N���N�n����,,,,,,,,
221007,2210070061,�É����É��s,�m�ȓs�s�R���𗬃Z���^�[�i���т��j,�����V�i�g�V�T���\���R�E�����E�Z���^�[�����r�R,,221007,,����匴�P�W�R�S�Ԓn,,����匴�P�W�R�S�Ԓn,,,,,,,,�{�ݓ���,054-270-1501,,,,,,,,�ΐ��؋��y��,9:00,17:00,��S�Ηj���A�N���N�n����,,,,,,,,
221007,2210070062,�É����É��s,�É������q��Ďx���Z���^�[,�V�Y�I�J�`���E�I�E�R�\�_�e�V�G���Z���^�[,,221007,,����������񒚖ڂP�|�P,,����������񒚖ڂP�|�P,,,,,,,,�S�K�𗬃T�������֍�,054-248-4044,,,,,,,,���Ζ؋��y��,9:00,17:00,�N���N�n����,,,,,,,,
221007,2210070063,�É����É��s,�É������q��Ďx���Z���^�[,�V�Y�I�J�`���E�I�E�R�\�_�e�V�G���Z���^�[,,221007,,����������񒚖ڂP�|�P,,����������񒚖ڂP�|�P,,,,,,,,�R�K�ꎞ�ۈ玺���֍�,054-246-7224,,,,,,,,���ΐ��؋��y��,,,�{�݂̗��p�\���Ԃɏ]��,,,,,,,,
221007,2210070064,�É����É��s,���@������,�A�T�o�^�W�h�E�J��,,221007,,����L�i���U�|�P,,����L�i���U�|�P,,,,,,,,���փz�[��,054-248-4044,,,,,,,,�ΐ��؋��y��,9:00,17:30,��R���j���A�N���N�n����,,,,,,,,
221007,2210070065,�É����É��s,����������,�A���h�E�W�h�E�J��,,221007,,��������񒚖ڂP�U�|�P�Q,,��������񒚖ڂP�U�|�P�Q,,,,,,,,�������O�L��,054-246-7244,,,,,,,,�ΐ��؋��y��,9:00,17:30,��R���j���A�N���N�n����,,,,,,,,
221007,2210070066,�É����É��s,���ގ�����,�j�V�i�W�h�E�J��,,221007,,���搣���꒚�ڂP�X�|�R�O,,���搣���꒚�ڂP�X�|�R�O,,,,,,,,���փz�[��,054-263-6343,,,,,,,,�ΐ��؋��y��,9:00,17:30,��R���j���A�N���N�n����,,,,,,,,
221007,2210070067,�É����É��s,���D������,�n�g���W�h�E�J��,,221007,,����H���Z���ڂQ�V�|�P�S,,����H���Z���ڂQ�V�|�P�S,,,,,,,,�������O�L��,054-277-1201,,,,,,,,�ΐ��؋��y��,9:00,17:30,��R���j���A�N���N�n����,,,,,,,,
221007,2210070068,�É����É��s,���a������,�~���W�h�E�J��,,221007,,������{���c�n�Q�|�P�O,,������{���c�n�Q�|�P�O,,,,,,,,���փz�[��,054-296-4156,,,,,,,,�ΐ��؋��y��,9:00,17:30,��R���j���A�N���N�n����,,,,,,,,
221007,2210070069,�É����É��s,��{��񎙓��N���u,�C�m�~���_�C�j�W�h�E�N���u,,221007,,���敽�a�꒚�ڂT�|�U�|�S,,���敽�a�꒚�ڂT�|�U�|�S,,,,,,,,���֕t��,054-221-9802,,,,,,,,���ΐ��؋��y,,,�{�݂̗��p�\���Ԃɏ]��,,,,,,,,
221007,2210070070,�É����É��s,�㑫�􎙓��N���u,�J�~�A�V�A���C�W�h�E�N���u,,221007,,����㑫��꒚�ڂW�|26,,����㑫��꒚�ڂW�|26,,,,,,,,���փz�[��,054-209-5553,,,,,,,,���ΐ��؋��y,,,�{�݂̗��p�\���Ԃɏ]��,,,,,,,,
221007,2210070071,�É����É��s,�B�J�����N���u,�N�c�m���W�h�E�N���u,,221007,,����B�J�l����23�|20,,����B�J�l����23�|20,,,,,,,,���փz�[��,054-263-0855,,,,,,,,���ΐ��؋��y,,,�{�݂̗��p�\���Ԃɏ]��,,,,,,,,
221007,2210070072,�É����É��s,���D��񎙓��N���u,�n�g���_�C�j�W�h�E�N���u,,221007,,����H���񒚖�12�|19,,����H���񒚖�12�|19,,,,,,,,���փz�[��,054-277-3624,,,,,,,,���ΐ��؋��y,,,�{�݂̗��p�\���Ԃɏ]��,,,,,,,,
221007,2210070073,�É����É��s,��썂��Ґ��������Z���^�[,�C�J���R�E���C�V���Z�C�J�c�t�N�V�Z���^�[,,221007,,������P�P�R�R�Ԓn�̂Q,,������P�P�R�R�Ԓn�̂Q,,,,,,,,�Q�K�f�C���[��,054-260-2227,,,,,,,,���ΐ��؋��y,8:30,17:00,�x�ٓ�����,,,,,,,,
221007,2210070074,�É����É��s,�~��������Ґ��������Z���^�[,�E���K�V�}�R�E���C�V���Z�C�J�c�t�N�V�Z���^�[,,221007,,��������Q�S�U�Ԓn,,��������Q�S�U�Ԓn,,,,,,,,���֍�����,054-207-4477,,,,,,,,���ΐ��؋��y,8:30,17:00,�x�ٓ�����,,,,,,,,
221007,2210070075,�É����É��s,��썂��Ґ��������Z���^�[,�I�I�J���R�E���C�V���Z�C�J�c�t�N�V�Z���^�[,,221007,,��������P�O�Ԓn,,��������P�O�Ԓn,,,,,,,,������O,054-206-5880,,,,,,,,���ΐ��؋��y,8:30,17:00,�x�ٓ�����,,,,,,,,
221007,2210070076,�É����É��s,�~�P�r�V�l�����Z���^�[,�N�W���K�C�P���E�W���t�N�V�Z���^�[,,221007,,���扺�X�T�P�Ԓn�̂P,,���扺�X�T�P�Ԓn�̂P,,,,,,,,�P�K��������,054-294-9778,,,,,,,,�ΐ��؋��y��,9:00,16:00,,,,,,,,,
221007,2210070077,�É����É��s,�É��V�l�z�[��,�V�Y�I�J���E�W���z�[��,,221007,,����g�ÂP�X�O�T�Ԓn,,����g�ÂP�X�O�T�Ԓn,,,,,,,,���փz�[���̒�,054-278-1727,,,,,,,,���ΐ��؋��y��,6:00,18:00,�d�b�܂��̓C���^�[�z���ɂĂ���������������,,,,,,,,
221007,2210070078,�É����É��s,������V�l�����Z���^�[,�i�K�I�K�����E�W���t�N�V�Z���^�[,,221007,,���撷���P�P�V�Ԓn,,���撷���P�P�V�Ԓn,,,,,,,,�P�K��������,054-265-1415,,,,,,,,�ΐ��؋��y��,9:00,16:00,�x�ٓ�����,,,,,,,,
221007,2210070079,�É����É��s,�É��s���̉�,�V�Y�I�J�V�T�N���m�\�m,,221007,,������q�P�T�U�O�Ԓn�U,,������q�P�T�U�O�Ԓn�U,,,,,,,,�ݑ�T�[�r�X�ێw��������,054-296-2000,,,,,,,,���ΐ��؋��y��,0:00,23:59,,,,,,,,,
221007,2210070080,�É����É��s,�É��s���̉�,�V�Y�I�J�V�T�N���m�\�m,,221007,,������q�P�T�U�O�Ԓn�U,,������q�P�T�U�O�Ԓn�U,,,,,,,,�㖱����,054-296-2000,,,,,,,,���ΐ��؋��y��,0:00,23:59,,,,,,,,,
221007,2210070081,�É����É��s,�É��s���̉���k��,�V�Y�I�J�V�T�N���m�\�m�W���E�z�N�J��,,221007,,����k�����l���ڂR�Q�ԂR�S��,,����k�����l���ڂR�Q�ԂR�S��,,,,,,,,�E������,054-200-5551,,,,,,,,���ΐ��؋�,8:30,17:30,,,,,,,,,
221007,2210070082,�É����É��s,�É��s�S�g��Q�������Z���^�[�������̉�,�V�Y�I�J�V�V���V���V���E�K�C�W�t�N�V�Z���^�[�C�R�C�m�C�G,,221007,,����铌���Q�S�ԂP��,,����铌���Q�S�ԂP��,,,,,,,,��t,054-249-3190,,,,,,,,���ΐ��؋�,8:30,17:15,,,,,,,,,
221007,2210070083,�É����É��s,�É��s�~�쏊,�V�Y�I�J�V�L���E�S�V��,,221007,,����g�ÂP�X�O�T�Ԓn,,����g�ÂP�X�O�T�Ԓn,,,,,,,,��쎺,054-278-6239,,,,,,,,���ΐ��؋�,8:30,17:00,,,,,,,,,
221007,2210070084,�É����É��s,�n�敟���𗬃v���U,�`�C�L�t�N�V�R�E�����E�v���U,,221007,,����铌���Q�S��1 ��,,����铌���Q�S��1 ��,,,,,,,,�P�K���E�|�V�F�b�g��,054-249-3183,,,,,,,,���ΐ��؋��y,8:30,21:00,��Q���j���A�N���N�n����,,,,,,,,
221007,2210070085,�É����É��s,���������Z���^�[,�`���E�I�E�t�N�V�Z���^�[,,221007,,���������P�ԂP��,,���������P�ԂP��,,,,,,,,�P�K���֎�t��,054-273-8133,,,,,,,,���ΐ��؋��y,9:00,21:00,��S���j���A�N���N�n����,,,,,,,,
221007,2210070086,�É����É��s,�������k��,�W�h�E�\�E�_���V��,,221007,,����璬�X�P�S�Ԓn�̂S�P�V,,����璬�X�P�S�Ԓn�̂S�P�V,,,,,,,,�P�K��������,054-275-2874,,,,,,,,���ΐ��؋�,8:30,17:15,�j������,,,,,,,,
221007,2210070087,�É����É��s,��y���ǂ���,�A�Q�c�`�R�h���G��,,221007,,����Ï��l���ڂQ��11��,,����Ï��l���ڂQ��11��,,,,,,,,�P�K���փ��r�[,054-261-6044,,,,,,,,���ΐ��؋��y,7:00,19:00,,,,,,,,,
221007,2210070088,�É����É��s,���{���������ǂ���,�A�x�O�`�`���E�I�E�R�h���G��,,221007,,������{���c�n�R�ԂP��,,������{���c�n�R�ԂP��,,,,,,,,�P�K����,054-296-0345,,,,,,,,���ΐ��؋��y,7:00,18:00,,,,,,,,,
221007,2210070089,�É����É��s,�~�P�����ǂ���,�E���K�V�}�R�h���G��,,221007,,����~�����T�S�S�Ԓn�̂S,,����~�����T�S�S�Ԓn�̂S,,,,,,,,���֍�����,054-269-2004,,,,,,,,,,,�g�p�s��,,,,,,,,
221007,2210070090,�É����É��s,�����삱�ǂ���,�Z�i�K���R�h���G��,,221007,,���搣����꒚�ڂQ�P�ԂS�O��,,���搣����꒚�ڂQ�P�ԂS�O��,,,,,,,,�P�K���֍���,054-262-5940,,,,,,,,���ΐ��؋��y,7:00,19:00,,,,,,,,,
221007,2210070091,�É����É��s,�c�����ǂ���,�^�}�`�R�h���G��,,221007,,����c���꒚�ڂV�X�Ԓn,,����c���꒚�ڂV�X�Ԓn,,,,,,,,�P�K���փ��r�[,054-252-6374,,,,,,,,���ΐ��؋��y,7:00,19:00,,,,,,,,,
221007,2210070092,�É����É��s,�������ǂ���,�i�K�k�}�R�h���G��,,221007,,���撷���񒚖ڂP�W�ԂR�P��,,���撷���񒚖ڂP�W�ԂR�P��,,,,,,,,�P�K���փ��r�[,054-261-1241,,,,,,,,���ΐ��؋��y,7:00,19:00,,,,,,,,,
221007,2210070093,�É����É��s,���m�Ȃ��ǂ���,�i�J�����V�i�R�h���G��,,221007,,����匴�P�Q�R�V�Ԓn,,����匴�P�Q�R�V�Ԓn,,,,,,,,�P�K���փ��r�[�ʘH��,054-279-0002,,,,,,,,���ΐ��؋��y,7:00,18:00,,,,,,,,,
221007,2210070094,�É����É��s,���D�������ǂ���,�n�g���`���E�I�E�R�h���G��,,221007,,����H���{���Q�T�ԂR�R��,,����H���{���Q�T�ԂR�R��,,,,,,,,�P�K����,054-278-2217,,,,,,,,���ΐ��؋��y,7:00,19:00,,,,,,,,,
221007,2210070095,�É����É��s,���D���ǂ���,�n�g���R�h���G��,,221007,,����R��꒚�ڂP�V�Ԓn�̂P,,����R��꒚�ڂP�V�Ԓn�̂P,,,,,,,,�P�K���փ��r�[,054-278-9721,,,,,,,,���ΐ��؋��y,7:00,18:00,,,,,,,,,
221007,2210070096,�É����É��s,���ҋ@������,�A�I�C�^�C�L�W�h�E�G��,,221007,,������c�O���ڂR�ԂQ�T��,,������c�O���ڂR�ԂQ�T��,,,,,,,,�������O,054-207-8883,,,,,,,,���ΐ��؋��y,7:00,19:00,,,,,,,,,
221007,2210070097,�É����É��s,���{�����ǂ���,�A�x�O�`�R�h���G��,,221007,,������{���V�c�S�R�Ԓn�̂P,,������{���V�c�S�R�Ԓn�̂P,,,,,,,,�E��������,054-296-1824,,,,,,,,���ΐ��؋��y,7:00,18:00,,,,,,,,,
221007,2210070098,�É����É��s,�������ǂ���,�A���h�E�R�h���G��,,221007,,��������O���ڂP�P�ԂP�V��,,��������O���ڂP�P�ԂP�V��,,,,,,,,�P�K����,054-245-6227,,,,,,,,���ΐ��؋��y,7:00,19:00,,,,,,,,,
221007,2210070099,�É����É��s,���ނ��ǂ���,�j�V�i�R�h���G��,,221007,,���搣���O���ڂQ�S�Ԓn�Q�T��,,���搣���O���ڂQ�S�Ԓn�Q�T��,,,,,,,,�P�K����,054-261-3016,,,,,,,,���ΐ��؋��y,7:00,18:00,,,,,,,,,
221007,2210070100,�É����É��s,�m�Ȃ��ǂ���,�����V�i�R�h���G��,,221007,,����g�ÂP�Ԓn,,����g�ÂP�Ԓn,,,,,,,,�P�K����,054-278-6637,,,,,,,,���ΐ��؋�,7:00,18:00,,,,,,,,,
221007,2210070101,�É����É��s,��삱�ǂ���,�I�I�J���R�h���G��,,221007,,�����m��1239�Ԓn�̂S,,�����m��1239�Ԓn�̂S,,,,,,,,�P�K����,054-291-2123,,,,,,,,,,,�g�p�s��,,,,,,,,
221007,2210070102,�É����É��s,��삱�ǂ���,�C�J���R�h���G��,,221007,,������548�Ԓn�̂P,,������548�Ԓn�̂P,,,,,,,,�P�K����,054-260-2301,,,,,,,,���ΐ��؋�,7:00,18:00,,,,,,,,,
221007,2210070103,�É����É��s,���a���E�a�㎙�ۈ玺,�A�I�C�r���E�W�r���E�S�W�z�C�N�V�c,,221007,,���擌���[���W�|18,,���擌���[���W�|18,,,,,,,,�Q�K�ۈ玺��,054-247�8150,,,,,,,,���ΐ��؋�,8:30,17:00,,,,,,,,,
221007,2210070104,�É����É��s,���f�Ï�,�C�J���V�������E�W��,,221007,,���� ���P�P�R�R�Ԓn�̂Q,,���� ���P�P�R�R�Ԓn�̂Q,,,,,,,,�P�K�f�Î�,054-260-2300,,,,,,,,���ΐ��؋�,8:30,17:00,�{�݂̗��p�\���Ԃɏ]��,,,,,,,,
221007,2210070105,�É����É��s,�~�����f�Ï�,�E���K�V�}�V�������E�W��,,221007,,����~�����P�R�Q�U�Ԓn,,����~�����P�R�Q�U�Ԓn,,,,,,,,�f�@����,054-269-2025,,,,,,,,���΋�,9:00,17:00,��t�ݑ�̏ꍇ�͎g�p��,,,,,,,,
221007,2210070106,�É����É��s,���f�Ï�,�I�I�J���V�������E�W��,,221007,,�����m��U�P�T�Ԓn,,�����m��U�P�T�Ԓn,,,,,,,,���֑O,054-291-2622,,,,,,,,���ΐ����y,9:00,17:00,��t�s�݂̏ꍇ�A���p��ɕی���Éۂ֘A��,,,,,,,,
221007,2210070107,�É����É��s,��͓��f�Ï�,�I�I�R�E�`�V�������E�W��,,221007,,���敽��P�O�X�V�Ԓn�̂R�X,,���敽��P�O�X�V�Ԓn�̂R�X,,,,,,,,���u����,054-293-2021,,,,,,,,�ΐ��y,,,�{�݂̗��p�\���Ԃɏ]��,,,,,,,,
221007,2210070108,�É����É��s,�ʐ�f�Ï�,�^�}�J���V�������E�W��,,221007,,���旎���Q�S�R�Ԓn�̂U,,���旎���Q�S�R�Ԓn�̂U,,,,,,,,�f�@����,054-292-2223,,,,,,,,���ΐ���,9:00,17:00,,,,,,,,,
221007,2210070109,�É����É��s,������̌��N�Z���^�[,�R�R���m�P���R�E�Z���^�[,,221007,,����M��1014�Ԓn,,����M��1014�Ԓn,,,,,,,,�Q�K�z�[��,054-262-3011,,,,,,,,���ΐ��؋�,8:30,17:00,�j���A�N���N�n����,,,,,,,,
221007,2210070110,�É����É��s,��Q�Ҏ��ȕی��Z���^�[,�V���E�K�C�V���V�J�z�P���Z���^�[,,221007,,����铌���Q�S�ԂP��,,����铌���Q�S�ԂP��,,,,,,,,�ی������P�K�É��s��Q�Ҏ��ȕی��Z���^�[�f�Î���,054-249-3147,,,,,,,,�ΐ��؋��y,8:30,17:15,�j������,,,,,,,,
221007,2210070111,�É����É��s,�n�惊�n�r���e�[�V�������i�Z���^�[,�`�C�L���n�r���e�[�V�����X�C�V���Z���^�[,,221007,,����铌���Q�S�ԂP��,,����铌���Q�S�ԂP��,,,,,,,,�ی������������Q�K��������,054-249-3182,,,,,,,,���ΐ��؋�,8:30,17:15,�j���A�N���N�n����,,,,,,,,
221007,2210070112,�É����É��s,�ی����i�Q�K�j,�z�P���W���j�J�C,,221007,,����铌���Q�S�ԂP��,,����铌���Q�S�ԂP��,,,,,,,,�ی������Q�K�����q���ۑO,054-249-3170,,,,,,,,���ΐ��؋�,8:30,17:15,�j���A�N���N�n����,,,,,,,,
221007,2210070113,�É����É��s,�~�}���ȃZ���^�[,�L���E�L���E�V�J�Z���^�[,,221007,,����铌���Q�S�ԂP��,,����铌���Q�S�ԂP��,,,,,,,,�f�@����,054-249-1199,,,,,,,,���ΐ��؋���,8:30,17:00,�{�݂̗��p�\���Ԃɏ]��,,,,,,,,
221007,2210070114,�É����É��s,�}�a�Z���^�[,�L���E�r���E�Z���^�[,,221007,,����M��1014�Ԓn,,����M��1014�Ԓn,,,,,,,,�f�@����,054-261-1111,,,,,,,,���ΐ��؋��y��,19:00,22:00,,,,,,,,,
221007,2210070115,�É����É��s,���������,�h�E�u�c�A�C�S�J��,,221007,,����Y���X�T�S�Ԓn,,����Y���X�T�S�Ԓn,,,,,,,,�P�K��t��,054-278-4070,,,,,,,,���ΐ��؋��y��,9:00,16:00,�N���N�n����,,,,,,,,